Ethereum Mist: Compiling Error with sha3

0 votes
Unhandled rejection Error: Error: npm exited with code 1
Output:

> sha3@1.2.0 install /home/user/mist/dist_mist/app/node_modules/sha3
> node-gyp rebuild

make: Entering directory '/home/user/mist/dist_mist/app/node_modules/sha3/build'
  CXX(target) Release/obj.target/sha3/src/addon.o
sha3.target.mk:96: recipe for target 'Release/obj.target/sha3/src/addon.o' failed
make: Leaving directory '/home/user/mist/dist_mist/app/node_modules/sha3/build'

Error output:
In file included from /usr/include/stdint.h:25:0,
                 from /usr/lib/gcc/x86_64-linux-gnu/5/include/stdint.h:9,
                 from /home/user/.electron-gyp/.node-gyp/iojs-1.4.15/deps/v8/include/v8.h:19,
                 from /home/user/.electron-gyp/.node-gyp/iojs-1.4.15/src/node.h:42,
                 from ../src/addon.cpp:1:
/usr/include/features.h:367:25: fatal error: sys/cdefs.h: No such file or directory
compilation terminated.
make: *** [Release/obj.target/sha3/src/addon.o] Error 1
gyp ERR! build error 
gyp ERR! stack Error: `make` failed with exit code: 2
gyp ERR! stack     at ChildProcess.onExit (/usr/lib/node_modules/npm/node_modules/node-gyp/lib/build.js:258:23)
gyp ERR! stack     at emitTwo (events.js:125:13)
gyp ERR! stack     at ChildProcess.emit (events.js:213:7)
gyp ERR! stack     at Process.ChildProcess._handle.onexit (internal/child_process.js:200:12)
gyp ERR! System Linux 4.10.0-28-generic
gyp ERR! command "/usr/bin/nodejs" "/usr/lib/node_modules/npm/node_modules/node-gyp/bin/node-gyp.js" "rebuild"
gyp ERR! cwd /home/user/mist/dist_mist/app/node_modules/sha3
gyp ERR! node -v v8.2.1
gyp ERR! node-gyp -v v3.6.2
gyp ERR! not ok 
npm ERR! code ELIFECYCLE
npm ERR! errno 1
npm ERR! sha3@1.2.0 install: `node-gyp rebuild`
npm ERR! Exit status 1
npm ERR! 
npm ERR! Failed at the sha3@1.2.0 install script.
npm ERR! This is probably not a problem with npm. There is likely additional logging output above.

Command:

 gulp --linux in ~/mist. 

Oct 24, 2018 in Blockchain by slayer
• 29,050 points
43 views

1 answer to this question.

0 votes

First run:

npm install sha3 

and then

sudo yarn 

This should work.

answered Oct 24, 2018 by Omkar
• 67,290 points

Related Questions In Blockchain

0 votes
1 answer

composer network start with error SERVICE_UNAVAILABLE

I think there is an issue with ...READ MORE

answered Jul 5, 2018 in Blockchain by ariaholic
• 7,320 points
80 views
0 votes
1 answer

'ppa:ethereum' error while installing ethereum on ubuntu

First try: sudo apt-get install --reinstall ca-certificates If ...READ MORE

answered Jul 12, 2018 in Blockchain by slayer
• 29,050 points
156 views
0 votes
1 answer

Error in sending value to an Ethereum Smart Contract.

It is stated in Solidity 4.0 documentation ...READ MORE

answered Jul 23, 2018 in Blockchain by Perry
• 17,010 points
48 views
0 votes
1 answer

Unable to create a Mist connection to a private Ethereum Blockchain.

You could do the following: 1. Start another ...READ MORE

answered Jul 26, 2018 in Blockchain by Perry
• 17,010 points
37 views
0 votes
1 answer

Truffle tests not running after truffle init

This was a bug. They've fixed it. ...READ MORE

answered Sep 11, 2018 in Blockchain by Christine
• 15,790 points
123 views
0 votes
1 answer
0 votes
1 answer

Protocols used in a distributed/dlt system for the nodes to establish communication

yes all are over TCP/IP connections secured by TLS encryption in hashgraph architecture-hashgraph, ...READ MORE

answered Aug 6, 2018 in Blockchain by ariaholic
• 7,320 points
63 views
+1 vote
1 answer

Ethereum Error: authentication needed: password or unlock

First, make sure you have an account. web3.personal.listAccounts If ...READ MORE

answered Aug 8, 2018 in Blockchain by Omkar
• 67,290 points
438 views
0 votes
2 answers

How to generate ethereum qr code address with amount?

You implement this package: ethereum-qr-code. It implements the EIP67 standard which uses ...READ MORE

answered Sep 6, 2018 in Blockchain by Omkar
• 67,290 points
402 views