Boost issue while building Litecoin

0 votes

I have pulled Litecoin from master branch and when i try to build on OSX i get the error:

CXXLD litecoind
Undefined symbols for architecture x86_64:
"boost::this_thread::hiden::sleep_for(timespec const&)", referenced from:
MilliSleep(long long) in libbitcoin_util.a(libbitcoin_util_a-utiltime.o)
ld: symbol(s) not found for architecture x86_64
clang: error: linker command failed with exit code 1 (use -v to see invocation)
make[2]: *** [litecoind] Error 1
make[1]: *** [all-recursive] Error 1
make: *** [all-recursive] Error 1

Please help

Sep 7, 2018 in Blockchain by digger
• 26,550 points
55 views

1 answer to this question.

0 votes

Try reinstalling boost (uninstall and install again), then run this:

brew link boost --force

answered Sep 7, 2018 by slayer
• 29,170 points

Related Questions In Blockchain

0 votes
1 answer

Network issue while testing Chaincode.

You can do the following things: You can ...READ MORE

answered Jul 3, 2018 in Blockchain by Omkar
• 67,620 points
36 views
0 votes
1 answer
+1 vote
1 answer
0 votes
1 answer

Protocols used in a distributed/dlt system for the nodes to establish communication

yes all are over TCP/IP connections secured by TLS encryption in hashgraph architecture-hashgraph, ...READ MORE

answered Aug 6, 2018 in Blockchain by ariaholic
• 7,340 points
80 views
0 votes
1 answer

Truffle tests not running after truffle init

This was a bug. They've fixed it. ...READ MORE

answered Sep 11, 2018 in Blockchain by Christine
• 15,790 points
155 views
0 votes
1 answer
0 votes
1 answer

Getting error while building Bitcoind on MAC OS

First of all try building a non-GUI ...READ MORE

answered Aug 20, 2018 in Blockchain by slayer
• 29,170 points
41 views
0 votes
1 answer

'ppa:ethereum' error while installing ethereum on ubuntu

First try: sudo apt-get install --reinstall ca-certificates If ...READ MORE

answered Jul 12, 2018 in Blockchain by slayer
• 29,170 points
190 views